{"text_format":"1","workbook":"xlsx","n_sheets":24,"sheets":["Dataset","HSL","LVM","LSS","SOL","BU","THR","MFR_LMED","MFR_IVF","MFR_FOK","CAN","CAN_BC","DORS","Register","Variabellista","LMED","MFR","PAR_SV","PAR_OV","PAR_IDB","kod","Verifikation","EKB_AR","EKB_MAN"],"not_rendered":{"charts":0,"images":1,"macros":1,"external_links":0,"defined_names":27,"comments":17,"pivot_tables":0},"unopened":[],"bounds":{"document_bytes":16777216,"sheet_cells":100000,"rows_first":2000,"rows_last":500,"rows_between":2000,"halvings":0,"cell_chars":16384,"cell_head_chars":4096},"cells_cut":0,"cells_raw":0,"read":"whole","date_system":"1900"}

{"sheet":"Dataset","index":0,"n_rows":133,"n_cols":20,"rows_kept":133,"cut":false,"hidden":true,"merged":[]}
["RegisterFliknamn","Registernamn","Från","Till","Dataset","RegisterMin","RegisterMax","SASkatalog","DelRegister","ICD10","ICD9","ICD8 ","ICD7"]
["CAN","Cancerregistret",1958,2020,"r_can",{"$f":"MIN(IF($B$2:$B$133=B2,$C$2:$C$133,FALSE))","v":1958},{"$f":"MAX(IF($B$2:$B$133=B2,$D$2:$D$133,FALSE))","v":2020},"R_CAN"]
["CAN_BC","Basalcellscancerregistret",2004,2020,"r_can_bc",{"$f":"MIN(IF($B$2:$B$133=B3,$C$2:$C$133,FALSE))","v":2004},{"$f":"MAX(IF($B$2:$B$133=B3,$D$2:$D$133,FALSE))","v":2020},"R_CAN","BC"]
["DORS","Dödsorsaksregistret (inkl. avi)",2021,2022,"r_dors_avi",{"$f":"MIN(IF($B$2:$B$133=B4,$C$2:$C$133,FALSE))","v":1952},{"$f":"MAX(IF($B$2:$B$133=B4,$D$2:$D$133,FALSE))","v":2022},"R_DORS"]
["DORS","Dödsorsaksregistret (inkl. avi)",1997,2021,"r_dors",{"$f":"MIN(IF($B$2:$B$133=B5,$C$2:$C$133,FALSE))","v":1952},{"$f":"MAX(IF($B$2:$B$133=B5,$D$2:$D$133,FALSE))","v":2022},"R_DORS"]
["DORS","Dödsorsaksregistret (inkl. avi)",1987,1996,"r_dors_19871996",{"$f":"MIN(IF($B$2:$B$133=B6,$C$2:$C$133,FALSE))","v":1952},{"$f":"MAX(IF($B$2:$B$133=B6,$D$2:$D$133,FALSE))","v":2022},"R_DORS"]
{"$rows_left_out":128}
{"sheet":"HSL","index":1,"n_rows":29,"n_cols":20,"rows_kept":29,"cut":false,"hidden":true,"merged":[[0,3,0,20]]}
[null,null,null,"Registret över insatser i kommunal hälso- och sjukvård HSL"]
[]
["#","Val","Variabel","Klartext","Definition","Kommentar",null,null,null,null,null,"Variabel","Klartext",null,null,"Auto-kryssa:",null,null,null,false]
[{"$f":"IF($T4=FALSE, \"\", MAX(A$3:A3)+1)","v":""},null,"ALDER","Ålder","Ålder vid årets slut",null,null,null,null,null,null,{"$f":"IFERROR(INDEX(C$3:C$29,MATCH(ROW()-ROW(L$3),$A$3:$A$29,0)),\"\")","v":""},{"$f":"IFERROR(INDEX(D$3:D$29,MATCH(ROW()-ROW(M$3),$A$3:$A$29,0)),\"\")","v":""},null,null,null,null,null,null,false]
[{"$f":"IF($T5=FALSE, \"\", MAX(A$4:A4)+1)","v":""},null,"APR","Hade HSL i april","Personen har fått hälso- och sjukvård som kommunen ansvarar för enligt 18 § HSL under april",null,null,null,null,null,null,"","",null,null,null,null,null,null,false]
[{"$f":"IF($T6=FALSE, \"\", MAX(A$4:A5)+1)","v":""},null,"AR","År","Statistikår",null,null,null,null,null,null,"","",null,null,null,null,null,null,false]
{"$rows_left_out":24}
{"sheet":"LVM","index":2,"n_rows":50,"n_cols":20,"rows_kept":50,"cut":false,"hidden":true,"merged":[]}
[null,null,null,"Tvångsvård enligt lagen om vård av missbrukare LVM"]
[]
["#","Val","Variabel","Klartext","Definition","Kommentar",null,null,null,null,null,"Variabel","Klartext",null,null,"Auto-kryssa:"]
[{"$f":"IF($T4=FALSE, \"\", MAX(A$3:A3)+1)","v":""},null,"ALDER","Ålder","Ålder vid årets slut",null,null,null,null,null,null,{"$f":"IFERROR(INDEX(C$3:C$50,MATCH(ROW()-ROW(L$3),$A$3:$A$50,0)),\"\")","v":""},{"$f":"IFERROR(INDEX(D$3:D$50,MATCH(ROW()-ROW(M$3),$A$3:$A$50,0)),\"\")","v":""},null,null,null,null,null,null,false]
[{"$f":"IF($T5=FALSE, \"\", MAX(A$4:A4)+1)","v":""},null,"ANSDATUM","Ansökningsdatum","Ansökningsdatum",null,null,null,null,null,null,"","",null,null,null,null,null,null,false]
[{"$f":"IF($T6=FALSE, \"\", MAX(A$4:A5)+1)","v":""},null,"ANSDATUMN","Ansökningsdatum, numerisk SAS-datum","Ansökningsdatum, numerisk SAS-datum",null,null,null,null,null,null,"","",null,null,null,null,null,null,false]
{"$rows_left_out":45}
{"sheet":"LSS","index":3,"n_rows":35,"n_cols":20,"rows_kept":35,"cut":false,"hidden":true,"merged":[]}
[null,null,null,"Insatser enligt lagen om stöd och service till vissa funktionshindrade, LSS"]
[]
["#","Val","Variabel","Klartext","Definition","Kommentar",null,null,null,null,null,"Variabel","Klartext",null,null,"Auto-kryssa:"]
[{"$f":"IF($T4=FALSE, \"\", MAX(A$3:A3)+1)","v":""},null,"ALDER","Ålder","Ålder vid årets slut",null,null,null,null,null,null,{"$f":"IFERROR(INDEX(C$3:C$35,MATCH(ROW()-ROW(L$3),$A$3:$A$35,0)),\"\")","v":""},{"$f":"IFERROR(INDEX(D$3:D$35,MATCH(ROW()-ROW(M$3),$A$3:$A$35,0)),\"\")","v":""},null,null,null,null,null,null,false]
[{"$f":"IF($T5=FALSE, \"\", MAX(A$4:A4)+1)","v":""},null,"AR","År","Det år som de insamlade uppgifterna gäller för",null,null,null,null,null,null,"","",null,null,null,null,null,null,false]
[{"$f":"IF($T6=FALSE, \"\", MAX(A$4:A5)+1)","v":""},null,"BKOMM","Boendekommun","Boendekommun för personer som bor enligt 9 § 8 LSS eller 9 § 9 LSS och som bor i en annan kommun än i den beslutsfattande kommunen",null,null,null,null,null,null,"","",null,null,null,null,null,null,false]
{"$rows_left_out":30}
{"sheet":"SOL","index":4,"n_rows":90,"n_cols":20,"rows_kept":90,"cut":false,"hidden":true,"merged":[]}
[null,null,null,"Socialtjänstinsatser till äldre och personer med funktionsnedsättning, SOL"]
[]
["#","Val","Variabel","Klartext","Definition","Kommentar",null,null,null,null,null,"Variabel","Klartext",null,null,"Auto-kryssa:",null,null,null,true]
[{"$f":"IF($T4=FALSE, \"\", MAX(A$3:A3)+1)","v":""},null,"ABIST","Annat biståndsbeslut","Brukaren har den sista dagen i månaden ett verkställt biståndsbeslut om annan vård- eller omsorgsinsats",null,null,null,null,null,null,{"$f":"IFERROR(INDEX(C$3:C$90,MATCH(ROW()-ROW(L$3),$A$3:$A$90,0)),\"\")","v":""},{"$f":"IFERROR(INDEX(D$3:D$90,MATCH(ROW()-ROW(M$3),$A$3:$A$90,0)),\"\")","v":""},null,null,null,null,null,null,false]
[{"$f":"IF($T5=FALSE, \"\", MAX(A$4:A4)+1)","v":""},null,"ALDER","Ålder","Ålder vid årets slut",null,null,null,null,null,null,"","",null,null,null,null,null,null,false]
[{"$f":"IF($T6=FALSE, \"\", MAX(A$4:A5)+1)","v":""},null,"AR","År","Statistikår",null,null,null,null,null,null,"","",null,null,null,null,null,null,false]
{"$rows_left_out":85}
{"sheet":"BU","index":5,"n_rows":34,"n_cols":20,"rows_kept":34,"cut":false,"hidden":true,"merged":[]}
[null,null,null,"Registret över insatser för barn och unga, BU"]
[]
["#","Val","Variabel","Klartext","Definition","Kommentar",null,null,null,null,null,"Variabel","Klartext",null,null,"Auto-kryssa:"]
[{"$f":"IF($T4=FALSE, \"\", MAX(A$3:A3)+1)","v":""},null,"DEBUTAR","Debutår","Första året då beslut fattades om någon insats för barnet. ",null,null,null,null,null,{"$f":"IFERROR(INDEX(C$4:C$33,MATCH(ROW()-ROW(#REF!),$A$4:$A$33,0)),\"\")","v":""},{"$f":"IFERROR(INDEX(C$3:C$33,MATCH(ROW()-ROW(L$3),$A$3:$A$33,0)),\"\")","v":""},{"$f":"IFERROR(INDEX(D$3:D$33,MATCH(ROW()-ROW(M$3),$A$3:$A$33,0)),\"\")","v":""},null,null,null,null,null,null,false]
[{"$f":"IF($T5=FALSE, \"\", MAX(A$4:A4)+1)","v":""},null,"FFODLAND","Faderns födelseland","Faderns födelseland, landsnamn","För enskilda länder krävs EPN godkännande",null,null,null,null,{"$f":"IFERROR(INDEX(C$4:C$33,MATCH(ROW()-ROW(#REF!),$A$4:$A$33,0)),\"\")","v":""},"","",null,null,null,null,null,null,false]
[{"$f":"IF($T6=FALSE, \"\", MAX(A$4:A5)+1)","v":""},null,"FFODLAND_KOD","Faderns födelseland, kod ","Faderns födelseland, kod med två bokstäver enligt RTB.","För enskilda länder krävs EPN godkännande",null,null,null,null,{"$f":"IFERROR(INDEX(C$4:C$33,MATCH(ROW()-ROW(#REF!),$A$4:$A$33,0)),\"\")","v":""},"","",null,null,null,null,null,null,false]
{"$rows_left_out":29}
{"sheet":"THR","index":6,"n_rows":41,"n_cols":20,"rows_kept":41,"cut":false,"hidden":true,"merged":[]}
[null,null,null,"Tandhälsoregistret, THR"]
[]
["#","Val","Variabel","Klartext","Definition","Kommentar",null,null,null,null,null,"Variabel","Klartext",null,null,"Auto-kryssa:",null,null,null,false]
[{"$f":"IF($T4=FALSE, \"\", MAX(A$3:A3)+1)","v":""},null,"ALDER","Ålder vid besökårets slut","Patientens ålder vid besökårets slut",null,null,null,null,null,null,{"$f":"IFERROR(INDEX(C$3:C$41,MATCH(ROW()-ROW(L$3),$A$3:$A$41,0)),\"\")","v":""},{"$f":"IFERROR(INDEX(D$3:D$41,MATCH(ROW()-ROW(M$3),$A$3:$A$41,0)),\"\")","v":""},null,null,null,null,null,null,false]
[{"$f":"IF($T5=FALSE, \"\", MAX(A$4:A4)+1)","v":""},null,"ALT_ATGARD","Alternativ åtgärd","Åtgärd enligt de ersättningsregler som TLV föreskriver \n3-siffrig kod",null,null,null,null,null,null,"","",null,null,null,null,null,null,false]
[{"$f":"IF($T6=FALSE, \"\", MAX(A$4:A5)+1)","v":""},null,"AR","Besöksår","Året när besöket ägde rum",null,null,null,null,null,null,"","",null,null,null,null,null,null,false]
{"$rows_left_out":36}
{"sheet":"MFR_LMED","index":7,"n_rows":151,"n_cols":20,"rows_kept":151,"cut":false,"hidden":true,"merged":[]}
[null,null,null,"Medicinska Födelseregistret Läkemedel"]
[]
["#","Val","Variabel","Klartext","Definition","Kommentar",null,null,null,null,null,"Variabel","Klartext",null,null,"Auto-kryssa:"]
[{"$f":"IF($T4=FALSE, \"\", MAX(A$3:A3)+1)","v":""},null,"AR","Barnets födelseår","Barnets födelseår",null,null,null,null,null,null,{"$f":"IFERROR(INDEX(C$3:C$11,MATCH(ROW()-ROW(L$3),$A$3:$A$11,0)),\"\")","v":""},"",null,null,null,null,null,null,false]
[{"$f":"IF($T5=FALSE, \"\", MAX(A$4:A4)+1)","v":""},null,"ATC","ATC-kod enligt varuregistret. Översatt från fritext till ATC-kod.","ATC-kod enligt varuregistret. Översatt från fritext till ATC-kod.Preparat som inte har ATC-kod är kodade till olika grupper (2013 - )",null,null,null,null,null,null,"","",null,null,null,null,null,null,false]
[{"$f":"IF($T6=FALSE, \"\", MAX(A$4:A5)+1)","v":""},null,"BFODDAT","Barnets födelsedatum ","Barnets födelsedatum. Används för att matcha mot MFR. ","Rekommenderad variabel",null,null,null,null,null,"","",null,null,null,null,null,null,false]
{"$rows_left_out":146}
{"sheet":"MFR_IVF","index":8,"n_rows":151,"n_cols":20,"rows_kept":151,"cut":false,"hidden":true,"merged":[]}
[null,null,null,"Medicinska Födelseregistret, IVF"]
[]
["#","Val","Variabel","Klartext","Definition","Kommentar",null,null,null,null,null,"Variabel","Klartext",null,null,"Auto-kryssa:"]
[{"$f":"IF($T4=FALSE, \"\", MAX(A$3:A3)+1)","v":""},null,"BFODDAT","Barnets födelsedatum","Barnets födelsedatum","För fullständigt datum krävs särskild motivering ",null,null,null,null,null,{"$f":"IFERROR(INDEX(C$3:C$15,MATCH(ROW()-ROW(L$3),$A$3:$A$15,0)),\"\")","v":""},{"$f":"IFERROR(INDEX(D$3:D$15,MATCH(ROW()-ROW(M$3),$A$3:$A$15,0)),\"\")","v":""},null,null,null,null,null,null,false]
[{"$f":"IF($T5=FALSE, \"\", MAX(A$4:A4)+1)","v":""},null,"BFODDATN","Barnets födelsedatum ","Barnets födelsedatum ","För fullständigt datum krävs särskild motivering ",null,null,null,null,null,"","",null,null,null,null,null,null,false]
[{"$f":"IF($T6=FALSE, \"\", MAX(A$4:A5)+1)","v":""},null,"BLASTOCYST","Blastocystöverföring","Blastocystöverföring",null,null,null,null,null,null,"","",null,null,null,null,null,null,false]
{"$rows_left_out":146}
{"sheet":"MFR_FOK","index":9,"n_rows":153,"n_cols":20,"rows_kept":153,"cut":false,"hidden":true,"merged":[]}
[null,null,null,"Registret över fosterskador och kromosomavvikelser"]
[]
["#","Val","Variabel","Klartext","Definition","Kommentar",null,null,null,null,null,"Variabel","Klartext",null,null,"Auto-kryssa:",null,null,null,false]
[{"$f":"IF($T4=FALSE, \"\", MAX(A$3:A3)+1)","v":""},null,"ANTAL_FOK","Antal fosterskador/kromosomavvikelser","Antal fosterskador/kromosomavvikelser",null,null,null,null,null,null,{"$f":"IFERROR(INDEX(C$4:C$26,MATCH(ROW()-ROW(L$3),$A$4:$A$26,0)),\"\")","v":""},{"$f":"IFERROR(INDEX(D$4:D$153,MATCH(ROW()-ROW(M$3),$A$4:$A$26,0)),\"\")","v":""},null,null,null,null,null,null,false]
[{"$f":"IF($T5=FALSE, \"\", MAX(A$4:A4)+1)","v":""},null,"AR","Barnets födelseår","Barnets födelseår",null,null,null,null,null,null,"","",null,null,null,null,null,null,false]
[{"$f":"IF($T6=FALSE, \"\", MAX(A$4:A5)+1)","v":""},null,"BDIAG_BK1 - BDIAG_BK8","Diagnos 1 - 8 enligt Bengt Källén","Diagnos 1 - 8 enligt Bengt Källén",null,null,null,null,null,null,"","",null,null,null,null,null,null,false]
{"$rows_left_out":148}
{"sheet":"CAN","index":10,"n_rows":52,"n_cols":20,"rows_kept":52,"cut":false,"hidden":true,"merged":[]}
[null,null,null,"Cancerregistret"]
[]
["#","Val","Variabel","Klartext","Definition","Kommentar",null,null,null,null,null,"Variabel","Klartext",null,null,"Auto-kryssa:"]
[{"$f":"IF($T4=FALSE, \"\", MAX(A$3:A3)+1)","v":""},null,"ALDER","Ålder vid diagnos","Patientens ålder vid diagnos",null,null,null,null,null,null,{"$f":"IFERROR(INDEX(C$3:C$52,MATCH(ROW()-ROW(L$3),$A$3:$A$52,0)),\"\")","v":""},{"$f":"IFERROR(INDEX(D$3:D$52,MATCH(ROW()-ROW(M$3),$A$3:$A$52,0)),\"\")","v":""},null,null,null,null,null,null,false]
[{"$f":"IF($T5=FALSE, \"\", MAX(A$4:A4)+1)","v":""},null,"AR","År","Diagnosår",null,null,null,null,null,null,"","",null,null,null,null,null,null,false]
[{"$f":"IF($T6=FALSE, \"\", MAX(A$4:A5)+1)","v":""},null,"BEN","Malign/Benign","Indikator för malign eller benign tumör enligt morfologi.","Rekommenderad variabel",null,null,null,null,null,"","",null,null,null,null,null,null,false]
{"$rows_left_out":47}
{"sheet":"CAN_BC","index":11,"n_rows":55,"n_cols":20,"rows_kept":55,"cut":false,"hidden":true,"merged":[]}
[null,null,null,"Basalcellscancerregistret"]
[]
["#","Val","Variabel","Klartext","Definition","Kommentar",null,null,null,null,null,"Variabel","Klartext"]
[{"$f":"IF($T4=FALSE, \"\", MAX(A$3:A3)+1)","v":""},null,"ALDER","Ålder vid diagnos","Ålder vid  preparatets ankomst till patologavdelningen",null,null,null,null,null,null,{"$f":"IFERROR(INDEX(C$3:C$14,MATCH(ROW()-ROW(L$3),$A$3:$A$14,0)),\"\")","v":""},{"$f":"IFERROR(INDEX(D$3:D$14,MATCH(ROW()-ROW(M$3),$A$3:$A$14,0)),\"\")","v":""},null,null,null,null,null,null,false]
[{"$f":"IF($T5=FALSE, \"\", MAX(A$4:A4)+1)","v":""},null,"AR","År","Diagnosår. År för preparatets ankomst till patologavdelningen",null,null,null,null,null,null,"","",null,null,null,null,null,null,false]
[{"$f":"IF($T6=FALSE, \"\", MAX(A$4:A5)+1)","v":""},null,"DIADAT","Preparatets ankomstdatum","Datum för preparatets ankomst till patologavdelningen",null,null,null,null,null,null,"","",null,null,null,null,null,null,false]
{"$rows_left_out":50}
{"sheet":"DORS","index":12,"n_rows":50,"n_cols":20,"rows_kept":50,"cut":false,"hidden":true,"merged":[]}
[null,null,null,"Dödsorsaksregistret"]
[]
["#","Val","Variabel","Klartext","Definition","Kommentar",null,null,null,null,null,"Variabel","Klartext",null,null,"Auto-kryssa:",null,null,null,false]
[{"$f":"IF($T4=FALSE, \"\", MAX(A$3:A3)+1)","v":""},null,"ALDER","Ålder vid dödsfall","Ålder i år vid själva dödsfallet",null,null,null,null,null,null,{"$f":"IFERROR(INDEX(C$3:C$50,MATCH(ROW()-ROW(L$3),$A$3:$A$50,0)),\"\")","v":""},{"$f":"IFERROR(INDEX(D$3:D$50,MATCH(ROW()-ROW(M$3),$A$3:$A$50,0)),\"\")","v":""},null,null,null,null,null,null,false]
[{"$f":"IF($T5=FALSE, \"\", MAX(A$4:A4)+1)","v":""},null,"ALKOHOL","Alkoholrelaterad diagnos ","Alkoholrelaterad diagnos omnämnd på intyget. Markering för samtliga poster som har en alkoholrelaterad diagnos antingen som underliggande eller bidragande dödsorsak\n",null,null,null,null,null,null,"","",null,null,null,null,null,null,false]
[{"$f":"IF($T6=FALSE, \"\", MAX(A$4:A5)+1)","v":""},null,"ANTORS","Antal bidragande dödsorsaker",null,null,null,null,null,null,null,"","",null,null,null,null,null,null,false]
{"$rows_left_out":45}
{"sheet":"Register","index":13,"n_rows":37,"n_cols":21,"rows_kept":37,"cut":false,"hidden":false,"merged":[[0,2,0,6],[7,6,8,6],[10,6,11,6]]}
[null,null,"Skapa variabellista med SIV, Socialstyrelsens interaktiva variabelväljare"]
["v 5.3"]
[]
[null,"Register",null,"Årtal"]
[null,null,null,"Från","Till"]
[null,"Hälsodataregister",null,null,null,null,"Välkommen till SIV, Socialstyrelsens Interaktiva Variabelväljare!"]
{"$rows_left_out":32}
{"sheet":"Variabellista","index":14,"n_rows":9,"n_cols":3,"rows_kept":9,"cut":false,"hidden":false,"merged":[[2,2,4,2],[9,2,31,2]]}
[null,"Din variabellista"]
[]
[null,null,"Är du nöjd med din variabellista sparar du excelfilen som en xls fil.  Bifoga filen tillsammans med din  beställning av registeruppgifter."]
["Nedanstående tabeller innehåller de register med respektive variabler och år som beställts."]
["Register","År"]
["Det finns inga valda register",null,"Vill du lägga till eller ta bort variabler så klickar du \"Välj fler variabler\""]
{"$rows_left_out":4}
{"sheet":"LMED","index":15,"n_rows":63,"n_cols":20,"rows_kept":63,"cut":false,"hidden":true,"merged":[]}
[null,null,null,"Läkemedelsregistret"]
[]
["#","Val","Variabel","Klartext","Definition","Kommentar",null,null,null,null,null,"Variabel","Klartext",null,null,"Auto-kryssa:",null,null,null,false]
[{"$f":"IF($T4=FALSE, \"\", MAX(A$3:A3)+1)","v":""},null,"AFORM","Ägarform","Ägarform, enligt Arbetsplatskodregistret",null,null,null,null,null,null,{"$f":"IFERROR(INDEX(C$4:C$63,MATCH(ROW()-ROW(L$3),$A$4:$A$63,0)),\"\")","v":""},{"$f":"IFERROR(INDEX(D$4:D$63,MATCH(ROW()-ROW(M$3),$A$4:$A$63,0)),\"\")","v":""},null,null,null,null,null,null,false]
[{"$f":"IF($T5=FALSE, \"\", MAX(A$3:A4)+1)","v":""},null,"ALDER","Ålder","Ålder vid årets slut (Expeditionsår minus födelseår)",null,null,null,null,null,null,"","",null,null,null,null,null,null,false]
[{"$f":"IF($T6=FALSE, \"\", MAX(A$3:A5)+1)","v":""},null,"ANTAL","Antal förpackningar","Antal förpackningar som har hämtats ut. Vid dosdispenserade läkemedel kan antal förpackningar vara ett decimaltal. Negativa värden förekommer om information har korrigerats. Då krediteras den felaktiga raden genom att en ny rad med negativt värde registreras.  ","Rekommenderad variabel",null,null,null,null,null,"","",null,null,null,null,null,null,false]
{"$rows_left_out":58}
{"sheet":"MFR","index":16,"n_rows":149,"n_cols":20,"rows_kept":149,"cut":false,"hidden":true,"merged":[]}
[null,null,null,"Medicinska Födelseregistret"]
[]
["#","Val","Variabel","Klartext","Definition","Kommentar",null,null,null,null,null,"Variabel","Klartext",null,null,"Auto-kryssa:",null,null,null,false]
[{"$f":"IF($T4=FALSE, \"\", MAX(A$3:A3)+1)","v":""},null,"ACIDOS","Acidoskorrektion","Upplivningsåtgärder - Acidoskorrektion, minuter ",null,null,null,null,null,null,{"$f":"IFERROR(INDEX(C$3:C$149,MATCH(ROW()-ROW(L$3),$A$3:$A$149,0)),\"\")","v":""},{"$f":"IFERROR(INDEX(D$3:D$149,MATCH(ROW()-ROW(M$3),$A$3:$A$149,0)),\"\")","v":""},null,null,null,null,null,null,false]
[{"$f":"IF($T5=FALSE, \"\", MAX(A$4:A4)+1)","v":""},null,"AKUPUNKT","Akupunktur","Smärtlindring - Akupunktur",null,null,null,null,null,null,"","",null,null,null,null,null,null,false]
[{"$f":"IF($T6=FALSE, \"\", MAX(A$4:A5)+1)","v":""},null,"AMNIO","Fosterdiagnostik  amniocentes","Fosterdiagnostik, amniocentes (fostervattensprov)",null,null,null,null,null,null,"","",null,null,null,null,null,null,false]
{"$rows_left_out":144}
{"sheet":"PAR_SV","index":17,"n_rows":47,"n_cols":20,"rows_kept":47,"cut":false,"hidden":true,"merged":[]}
[null,null,null,"Patientregistret Slutenvård"]
[]
["#","Val","Variabel","Klartext","Definition","Kommentar",null,null,null,null,null,"Variabel","Klartext",null,null,"Auto-kryssa:"]
[{"$f":"IF($T4=FALSE, \"\", MAX(A$3:A3)+1)","v":""},null,"ALDER","Ålder","Ålder vid utskrivningsdatum",null,null,null,null,null,null,{"$f":"IFERROR(INDEX(C$3:C$46,MATCH(ROW()-ROW(L$3),$A$3:$A$46,0)),\"\")","v":""},{"$f":"IFERROR(INDEX(D$3:D$46,MATCH(ROW()-ROW(M$3),$A$3:$A$46,0)),\"\")","v":""},null,null,null,null,null,null,false]
[{"$f":"IF($T5=FALSE, \"\", MAX(A$4:A4)+1)","v":""},null,"ALDER_S","Ålder","Ålder vid slutet av året",null,null,null,null,null,null,"","",null,null,null,null,null,null,false]
[{"$f":"IF($T6=FALSE, \"\", MAX(A$4:A5)+1)","v":""},null,"ANE1","Anestesikod 1","Anestesikod 1",null,null,null,null,null,null,"","",null,null,null,null,null,null,false]
{"$rows_left_out":42}
{"sheet":"PAR_OV","index":18,"n_rows":79,"n_cols":20,"rows_kept":79,"cut":false,"hidden":true,"merged":[]}
[null,null,null,"Patientregistret Öppenvård"]
[]
["#","Val","Variabel","Klartext","Definition","Kommentar",null,null,null,null,null,"Variabel","Klartext",null,null,"Auto-kryssa:",null,null,null,true]
[{"$f":"IF($T4=FALSE, \"\", MAX(A$3:A3)+1)","v":""},null,"ALDER","Ålder ","Ålder vid besök",null,null,null,null,null,null,{"$f":"IFERROR(INDEX(C$4:C$43,MATCH(ROW()-ROW(L$3),$A$4:$A$43,0)),\"\")","v":""},{"$f":"IFERROR(INDEX(D$4:D$43,MATCH(ROW()-ROW(M$3),$A$4:$A$43,0)),\"\")","v":""},null,null,null,null,null,null,false]
[{"$f":"IF($T5=FALSE, \"\", MAX(A$4:A4)+1)","v":""},null,"ALDER_S","Ålder","Ålder vid årets slut",null,null,null,null,null,null,"","",null,null,null,null,null,null,false]
[{"$f":"IF($T6=FALSE, \"\", MAX(A$4:A5)+1)","v":""},null,"ANE1","Anestesikod","Anestesikod 1",null,null,null,null,null,null,"","",null,null,null,null,null,null,false]
{"$rows_left_out":74}
{"sheet":"PAR_IDB","index":19,"n_rows":62,"n_cols":20,"rows_kept":62,"cut":false,"hidden":true,"merged":[]}
[null,null,null,"Olycksfallsregistret IDB"]
[]
["#","Val","Variabel","Klartext","Definition","Kommentar",null,null,null,null,null,"Variabel","Klartext",null,null,"Auto-kryssa:",null,null,null,true]
[{"$f":"IF($T4=FALSE, \"\", MAX(A$3:A3)+1)","v":""},null,"AKTIVITET","Aktivitet vid skada","Patientens sysselsättning vid skadetillfället. Om patienten vart inblandad i flera aktiviteter vid skadetillfället ska den aktivitet som bedöms ha störst inverkan på skadehändelsen rapporteras. ",null,null,null,null,null,null,{"$f":"IFERROR(INDEX(C$3:C$57,MATCH(ROW()-ROW(L$3),$A$3:$A$57,0)),\"\")","v":""},{"$f":"IFERROR(INDEX(D$3:D$57,MATCH(ROW()-ROW(M$3),$A$3:$A$57,0)),\"\")","v":""},null,null,null,null,null,null,false]
[{"$f":"IF($T5=FALSE, \"\", MAX(A$4:A4)+1)","v":""},null,"ALDER","Ålder vid skada","Patientens ålder vid skadetillfället",null,null,null,null,null,null,"","",null,null,null,null,null,null,false]
[{"$f":"IF($T6=FALSE, \"\", MAX(A$4:A5)+1)","v":""},null,"ANNPROD","Annan produkt som bidragit till skada","Annan produkt som haft betydelse antingen för skadan eller för skadehändelsen",null,null,null,null,null,null,"","",null,null,null,null,null,null,false]
{"$rows_left_out":57}
{"sheet":"kod","index":20,"n_rows":0,"n_cols":0,"rows_kept":0,"cut":false,"hidden":true,"merged":[]}

{"sheet":"Verifikation","index":21,"n_rows":21,"n_cols":21,"rows_kept":21,"cut":false,"hidden":true,"merged":[]}
[null,null,null,null,"Verifiera variabler"]
[null,null,null,null,null,null,null,null,null,"Verifiera att dina variabler finns i registret\nHar du fått en variabellista som inte genererats ur SIW?\nHär kan du snabbt verifiera att de variabler du har finns i registret."]
["Välj register",null,null,null,null,null,null,null,"Ange variabler att verifiera"]
[12,null,null,null,null,null,null,null,null,null,null,null,null,null,null,null,null,null,null,"CAN","Cancerregistret"]
[null,null,null,null,null,null,null,null,null,"Klistra in dina variabler i kolumn i, (en variabel per rad), under Ange variabler att verifiera. ",null,null,null,null,null,null,null,null,null,"CAN_BC","Basalcellscancerregistret"]
[null,null,null,null,null,null,null,null,null,null,null,null,null,null,null,null,null,null,null,"DORS","Dödsorsaksregistret (inkl. avi)"]
{"$rows_left_out":16}
{"sheet":"EKB_AR","index":22,"n_rows":296,"n_cols":20,"rows_kept":296,"cut":false,"hidden":true,"merged":[]}
[null,null,null,"Ekonomiskt bistånd EKB, År"]
[]
["#","Val","Variabel","Klartext","Definition","Kommentar",null,null,null,null,null,"Variabel","Klartext",null,null,"Auto-kryssa:",null,null,null,true]
[{"$f":"IF($T4=FALSE, \"\", MAX(A$3:A3)+1)","v":""},null,"ALDER","Ålder ","Biståndsmottagarens ålder.",null,null,null,null,null,null,{"$f":"IFERROR(INDEX(C$3:C$291,MATCH(ROW()-ROW(L$3),$A$3:$A$291,0)),\"\")","v":""},{"$f":"IFERROR(INDEX(D$3:D$291,MATCH(ROW()-ROW(M$3),$A$3:$A$291,0)),\"\")","v":""},null,null,null,null,null,null,false]
[{"$f":"IF($T5=FALSE, \"\", MAX(A$4:A4)+1)","v":""},null,"AR","Statistikår","Statistikår",null,null,null,null,null,null,"","",null,null,null,null,null,null,false]
[{"$f":"IF($T6=FALSE, \"\", MAX(A$4:A5)+1)","v":""},null,"ARBLOSUE","Arbetslös utan ersättning","Arbetslös utan ersättning någon gång under året.",null,null,null,null,null,null,"","",null,null,null,null,null,null,false]
{"$rows_left_out":291}
{"sheet":"EKB_MAN","index":23,"n_rows":86,"n_cols":20,"rows_kept":86,"cut":false,"hidden":true,"merged":[]}
[null,null,null,null,"Ekonomiskt bistånd EKB, Månad"]
[]
["#","Val","Variabel","Klartext","Definition","Kommentar",null,null,null,null,null,"Variabel","Klartext",null,null,null,null,null,null,false]
[{"$f":"IF($T4=FALSE, \"\", MAX(A$3:A3)+1)","v":""},null,"ALDER","Ålder","Biståndsmottagarens ålder",null,null,null,null,null,null,{"$f":"IFERROR(INDEX(C$4:C$84,MATCH(ROW()-ROW(L$3),$A$4:$A$84,0)),\"\")","v":""},{"$f":"IFERROR(INDEX(D$4:D$84,MATCH(ROW()-ROW(M$3),$A$4:$A$84,0)),\"\")","v":""},null,null,null,null,null,null,false]
[{"$f":"IF($T5=FALSE, \"\", MAX(A$4:A4)+1)","v":""},null,"AR","Statistikår","Statistikår",null,null,null,null,null,null,"","",null,null,null,null,null,null,false]
[{"$f":"IF($T6=FALSE, \"\", MAX(A$4:A5)+1)","v":""},null,"FLYKTING","Flykting","Anger om biståndsmottagare är flytking eller inte",null,null,null,null,null,null,"","",null,null,null,null,null,null,false]
{"$rows_left_out":80}